Hexadecanedioic acid, bis(trimethylsilyl) ester
- Formula: C22H46O4Si2
- Molecular weight: 430.7692
- IUPAC Standard InChIKey: YANZXOCRRABPGY-UHFFFAOYSA-N
- Chemical structure:
View 3d structure (requires JavaScript / HTML 5) - Other names: Hexadecanedioic acid, bis-TMS; Hexadecandioic acid, bis(trimethylsilyl) ester

Van Den Dool and Kratz RI, non-polar column, temperature ramp

Column type | Active phase | I | Reference | Comment |
---|---|---|---|---|
Capillary | DB-1 | 2470. | Hoffmann, Aramaki, et al., 1989 | 30. m/0.53 mm/1. μm, He, 4. K/min; Tstart: 70. C; Tend: 290. C |

Van Den Dool and Kratz RI, non-polar column, custom temperature program

Column type | Active phase | I | Reference | Comment |
---|---|---|---|---|
Capillary | VF-5MS | 2470. | Tret'yakov, 2007 | 30. m/0.25 mm/0.25 μm, He; Program: Multi-step temperature program; T(initial)=60C; T(final)=270C |
Capillary | DB-1 | 2477. | Tsai, Oliphant, et al., 1985 | He; Program: not specified |
Packed | OV-101 | 2477. | Tanaka and Hine, 1982 | Program: not specified |

References

Hoffmann, Aramaki, et al., 1989
Hoffmann, G.; Aramaki, S.; Blum-Hoffmann, E.; Nyhan, W.L.; Sweetman, L.,
Quantitative analysis for organic acids in biological samples: batch isolation followed by gas chromatographic-mass spectrometric analysis,
Clin. Chem., 1989, 35, 4, 587-595. [all data]
Tret'yakov, 2007
Tret'yakov, K.V.,
Retention Data. NIST Mass Spectrometry Data Center., NIST Mass Spectrometry Data Center, 2007. [all data]
Tsai, Oliphant, et al., 1985
Tsai, M.Y.; Oliphant, C.; Josephson, M.W.,
Identification of Metabolites Diagnostic for Organic Acidurias by Simultaneous Dual-Column Capillary Gas Chromatography,
J. Chromatogr., 1985, 341, 1-10, https://doi.org/10.1016/S0378-4347(00)84004-9
. [all data]
Tanaka and Hine, 1982
Tanaka, K.; Hine, D.G.,
Compilation of Gas Chromatographic Retention Indices of 163 Metabolically Important Organic Acids, and Their Use in Detection of Patients with Organic Acidurias,
J. Chromatogr., 1982, 239, 301-322, https://doi.org/10.1016/S0021-9673(00)81990-1
. [all data]