3-Hexen-1-ol benzoate

Normal alkane RI, non-polar column, temperature ramp

Data compiled by: NIST Mass Spectrometry Data Center, William E. Wallace, director

Column type CapillaryCapillaryCapillary
Active phase RTX-5 MSRTX-1SE-30
Column length (m) 30.30.25.
Carrier gas HeN2N2
Substrate
Column diameter (mm) 0.250.250.22
Phase thickness (μm) 0.250.25
Tstart (C) 60.60.100.
Tend (C) 200.300.
Heat rate (K/min) 2.4.6.
Initial hold (min) 2.
Final hold (min) 10.
I 1585.1553.1541.
ReferenceEdris, Chizzola, et al., 2007Kalemba and Thiem, 2004Korhonen, 1986
Comment MSDC-RI MSDC-RI MSDC-RI

References

Edris, Chizzola, et al., 2007
Edris, A.E.; Chizzola, R.; Franz, C., Isolation and characterization of the volatile aroma compounds from the concrete headspace and the absolute of Jasminum sambac (L.) Ait. (Oleaceae) flowers grown in Egypt, Eur. Food Res. Technol., 2007, https://doi.org/10.1007/s00217-007-0623-y . [all data]

Kalemba and Thiem, 2004
Kalemba, D.; Thiem, B., Constituents of the essential oils of four micropropagated Solidago species, Flavour Fragr. J., 2004, 19, 1, 40-43, https://doi.org/10.1002/ffj.1271 . [all data]

Korhonen, 1986
Korhonen, I.O.O., Gas-Liquid Chromatographic Analyses. XLVII. Retention Increments of Some Lower Saturated Branched-Chain, Unsaturated and Chlorinated Esters of Benzoic, 4-Nitrobenzoic and 3,5-Dinitrobenzoic Acids on SE-30 and OV-351 Capillary Columns, J. Chromatogr., 1986, 360, 63-78, https://doi.org/10.1016/S0021-9673(00)91652-2 . [all data]