E-7-Octadecene
- Formula: C18H36
- Molecular weight: 252.4784
- IUPAC Standard InChIKey: VBDYOHYDAONYJK-FYWRMAATSA-N
- Chemical structure:
View 3d structure (requires JavaScript / HTML 5) - Species with the same structure:
- Stereoisomers:
- Other names: trans-7-Octadecene

Kovats' RI, non-polar column, isothermal

Column type | Active phase | Temperature (C) | I | Reference | Comment |
---|---|---|---|---|---|
Capillary | Apolane | 160. | 1773.1 | Soják, Krupcík, et al., 1980 | N2 or H2; Column length: 250. m; Column diameter: 0.25 mm |
Capillary | Apiezon L | 154. | 1773.6 | Soják, Krupcík, et al., 1980 | N2 or H2; Column length: 250. m; Column diameter: 0.25 mm |

Kovats' RI, polar column, isothermal

Column type | Active phase | Temperature (C) | I | Reference | Comment |
---|---|---|---|---|---|
Capillary | PEG-20M | 110. | 1805. | Rang, Orav, et al., 1988 | |
Capillary | Carbowax 20M | 110. | 1805. | Soják, Krupcík, et al., 1980 | N2; Column length: 300. m; Column diameter: 0.25 mm |

References

Soják, Krupcík, et al., 1980
Soják, L.; Krupcík, J.; Janák, J.,
Gas chromatography of all C15-C18 linear alkenes on capillary columns with very high resolution power,
J. Chromatogr., 1980, 195, 1, 43-64, https://doi.org/10.1016/S0021-9673(00)81542-3
. [all data]
Rang, Orav, et al., 1988
Rang, S.A.; Orav, A.E.; Kuningas, K.R.; Meister, A.E.; Strense, T.V.; Eisen, O.G.,
Gas-Chromatographic Characteristics of unsaturated hydrocarbons, Academy of Sciences of Estonia SSR, Tallinn, Estonia SSR, 1988, 208. [all data]