E-2-Tetradecen-1-ol
- Formula: C14H28O
- Molecular weight: 212.3715
- IUPAC Standard InChIKey: UNJNVKPKKZTPPR-OUKQBFOZSA-N
- Chemical structure:
View 3d structure (requires JavaScript / HTML 5) - Other names: 2-Tetradecen-1-ol, (E)

Kovats' RI, non-polar column, temperature ramp

Column type | Active phase | I | Reference | Comment |
---|---|---|---|---|
Capillary | DB-1 | 1666. | Smallfield, Perry, et al., 1994 | H2, 5. K/min; Column length: 9.5 m; Tstart: 50. C; Tend: 260. C |

Normal alkane RI, non-polar column, temperature ramp

Column type | Active phase | I | Reference | Comment |
---|---|---|---|---|
Capillary | HP-5 | 1713. | Yayli, Yasar, et al., 2005 | 30. m/0.32 mm/0.25 μm, He, 60. C @ 2. min, 5. K/min, 260. C @ 13. min |

Normal alkane RI, non-polar column, custom temperature program

Column type | Active phase | I | Reference | Comment |
---|---|---|---|---|
Capillary | SLB-5 MS | 1664. | Mondello, 2012 | 30. m/0.25 mm/0.25 μm, Helium; Program: not specified |
Capillary | SLB-5 MS | 1672. | Mondello, 2012 | 30. m/0.25 mm/0.25 μm, Helium; Program: not specified |

References

Smallfield, Perry, et al., 1994
Smallfield, B.M.; Perry, N.B.; Beauregard, D.A.; Foster, L.M.; Dodds, K.G.,
Effects of postharvest treatments on yield and composition of coriander herb oil,
J. Agric. Food Chem., 1994, 42, 2, 354-359, https://doi.org/10.1021/jf00038a023
. [all data]
Yayli, Yasar, et al., 2005
Yayli, N.; Yasar, A.; Gülec, C.; Usta, A.; Kolayli, S.; Coskuncelebi, K.; Karaoglu, S.,
Composition and antimicrobial activity of essential oils from Centaurea sessilis and Centaurea armena,
Phytochemistry, 2005, 66, 14, 1741-1745, https://doi.org/10.1016/j.phytochem.2005.04.006
. [all data]
Mondello, 2012
Mondello, L.,
HS-SPME-GCxGC-MS analysis of Yerba Mate (Ilex paraguariensis)
in Shimadzu GC-GC application compendium of comprehensive 2D GC, Vol. 1-5, Shimadzu Corp., 2012, 1-29. [all data]