Methoxyphenamine acetate

Kovats' RI, non-polar column, temperature ramp

View large format table.

Column type Active phase I Reference Comment
CapillaryHP-11820.Staack, Fehn, et al., 200312. m/0.2 mm/0.33 μm, He, 100. C @ 3. min, 30. K/min, 310. C @ 8. min

References

Staack, Fehn, et al., 2003
Staack, R.F.; Fehn, J.; Maurer, H.H., New designer drug p-methoxymethamphetamine: studies on its metabolism and toxicological detection in urine using gas chromatography-mass spectrometry, J. Chromatogr. B, 2003, 789, 1, 27-41, https://doi.org/10.1016/S1570-0232(02)01018-8 . [all data]