Neoisomenthyl acetate
- Formula: C12H22O2
- Molecular weight: 198.3019
- IUPAC Standard InChIKey: XHXUANMFYXWVNG-YUSALJHKSA-N
- Chemical structure:
View 3d structure (requires JavaScript / HTML 5) - Stereoisomers:

Kovats' RI, non-polar column, isothermal

Column type | Active phase | Temperature (C) | I | Reference | Comment |
---|---|---|---|---|---|
Packed | Apiezon L | 150. | 1276. | ter Heide, 1968 | N2, Embacel; Column length: 2.5 m |

Kovats' RI, non-polar column, custom temperature program

Column type | Active phase | I | Reference | Comment |
---|---|---|---|---|
Capillary | SF-96 | 1297. | Malingré and Maarse, 1974 | Column length: 150. m; Column diameter: 0.75 mm; Program: not specified |

Kovats' RI, polar column, isothermal

Column type | Active phase | Temperature (C) | I | Reference | Comment |
---|---|---|---|---|---|
Capillary | Carbowax 20M | 130. | 1602. | Malingré and Maarse, 1974 | Column length: 150. m; Column diameter: 0.75 mm |
Packed | Carbowax 20M | 150. | 1623. | ter Heide, 1968 | N2, Embacel; Column length: 2.5 m |

Normal alkane RI, non-polar column, custom temperature program

Column type | Active phase | I | Reference | Comment |
---|---|---|---|---|
Capillary | SE-30 | 1297. | Vinogradov, 2004 | Program: not specified |
Capillary | Methyl Silicone | 1297. | Zenkevich, 1999 | Program: not specified |

Normal alkane RI, polar column, custom temperature program

Column type | Active phase | I | Reference | Comment |
---|---|---|---|---|
Capillary | Carbowax 20M | 1612. | Vinogradov, 2004 | Program: not specified |

References

ter Heide, 1968
ter Heide, R.,
Studies on terpenes. II. Characterization of monoterpene esters by gas and thin-layer chromatography,
Z. Anal. Chem., 1968, 236, 215-227. [all data]
Malingré and Maarse, 1974
Malingré, T.M.; Maarse, H.,
Composition of the essential oil of Mentha aquatica,
Phytochemistry, 1974, 13, 8, 1531-1535, https://doi.org/10.1016/0031-9422(74)80322-5
. [all data]
Vinogradov, 2004
Vinogradov, B.A.,
Production, composition, properties and application of essential oils, 2004, retrieved from http://viness.narod.ru. [all data]
Zenkevich, 1999
Zenkevich, I.G.,
Analytical Parameters of Components of essential Oils for their Gas Chromatographic and Chromato-Mass-Spectral Identification. Acetates of Terpene Alcohols,
Rastitelnye Resursy (Plant Resources), 1999, 35, 1, 30-37. [all data]