Amorphane-b

Kovats' RI, non-polar column, isothermal

Data compiled by: NIST Mass Spectrometry Data Center, William E. Wallace, director

Column type Packed
Active phase SF-96
Column length (m) 3.0
Carrier gas
Substrate Chromosorb W-AW
Column diameter (mm)
Phase thickness (μm)
Temperature (C) 150.
I 1487.
ReferenceMaarse, 1975
Comment MSDC-RI

References

Maarse, 1975
Maarse, H., Hydrogenolysis of terpenes in the injection port of a gas chromatograph. II. Sesquiterpenes, J. Chromatogr., 1975, 106, 2, 369-384, https://doi.org/10.1016/S0021-9673(00)93846-9 . [all data]