Propylhexedrine acetate
- Formula: C12H23NO
- Molecular weight: 197.3171
- IUPAC Standard InChIKey: DLRVBJBEFQXHPU-UHFFFAOYSA-N
- Chemical structure:
View 3d structure (requires JavaScript / HTML 5) - Other names: Propylhexedrine, AC

Kovats' RI, non-polar column, temperature ramp

Column type | Active phase | I | Reference | Comment |
---|---|---|---|---|
Packed | OV-101 | 1570. | Maurer, 1990 | N2, Chromosorb G HP, 100. C @ 3. min, 30. K/min, 310. C @ 5. min; Column length: 0.6 m |

References

Maurer, 1990
Maurer, H.H.,
Detection of anticonvulsants and their metabolites in urine within a general unknown analysis procedure using computerized gas chromatography-mass spectrometry,
Arch. Toxicol., 1990, 64, 7, 554-561, https://doi.org/10.1007/BF01971834
. [all data]