3-Ethyl-1,5-octadiene

Van Den Dool and Kratz RI, non-polar column, temperature ramp

View large format table.

Column type Active phase I Reference Comment
CapillaryHP-1931.Cavalli, Fernandez, et al., 200350. m/0.2 mm/0.33 μm, He, 60. C @ 5. min, 2. K/min, 250. C @ 20. min
CapillaryHP-1938.Cavalli, Fernandez, et al., 200350. m/0.2 mm/0.33 μm, He, 60. C @ 5. min, 2. K/min, 250. C @ 20. min
CapillaryHP-1932.Cavalli, Fernandez, et al., 200350. m/0.2 mm/0.33 μm, He, 60. C @ 5. min, 2. K/min, 250. C @ 20. min
CapillaryHP-1939.Cavalli, Fernandez, et al., 200350. m/0.2 mm/0.33 μm, He, 60. C @ 5. min, 2. K/min, 250. C @ 20. min
CapillaryHP-1930.Cavalli, Fernandez, et al., 200350. m/0.2 mm/0.33 μm, He, 60. C @ 5. min, 2. K/min, 250. C @ 20. min
CapillaryHP-1937.Cavalli, Fernandez, et al., 200350. m/0.2 mm/0.33 μm, He, 60. C @ 5. min, 2. K/min, 250. C @ 20. min

Normal alkane RI, non-polar column, temperature ramp

View large format table.

Column type Active phase I Reference Comment
CapillaryHP-5947.Mildner-Szkudlarz and Jelen, 200810. m/0.10 mm/0.40 μm, Helium, 40. C @ 1. min, 20. K/min, 280. C @ 1. min
CapillaryHP-1932.Berlioz, Cordella, et al., 200650. m/0.2 mm/0.33 μm, N2, 2. K/min, 250. C @ 20. min; Tstart: 60. C
CapillaryHP-1939.Berlioz, Cordella, et al., 200650. m/0.2 mm/0.33 μm, N2, 2. K/min, 250. C @ 20. min; Tstart: 60. C
CapillaryHP-1932.Cavalli, Fernandez, et al., 200450. m/0.2 mm/0.33 μm, N2, 2. K/min, 250. C @ 20. min; Tstart: 60. C
CapillaryHP-1939.Cavalli, Fernandez, et al., 200450. m/0.2 mm/0.33 μm, N2, 2. K/min, 250. C @ 20. min; Tstart: 60. C
CapillaryMDN-5947.Mildner-Szkudlarz, Jelen, et al., 200330. m/0.25 mm/0.25 μm, He, 40. C @ 1. min, 20. K/min, 280. C @ 1. min

Normal alkane RI, polar column, temperature ramp

View large format table.

Column type Active phase I Reference Comment
CapillarySupelcowax-101012.Vichi, Castellote, et al., 200330. m/0.25 mm/0.25 μm, He, 40. C @ 10. min, 3. K/min; Tend: 200. C
CapillarySupelcowax-101018.Vichi, Castellote, et al., 200330. m/0.25 mm/0.25 μm, He, 40. C @ 10. min, 3. K/min; Tend: 200. C
CapillarySupelcowax-101006.Vichi, Pizzale, et al., 200330. m/0.25 mm/0.25 μm, He, 40. C @ 10. min, 3. K/min; Tend: 200. C
CapillarySupelcowax-101017.Vichi, Pizzale, et al., 200330. m/0.25 mm/0.25 μm, He, 40. C @ 10. min, 3. K/min; Tend: 200. C

Normal alkane RI, polar column, custom temperature program

View large format table.

Column type Active phase I Reference Comment
CapillarySupelcowax-101013.Vichi, Guadayol, et al., 200730. m/0.25 mm/0.25 μm, He; Program: 40C(3min) => 4C/min => 75C => 8C/min => 250C(5min)
CapillarySupelcowax-101027.Vichi, Guadayol, et al., 200730. m/0.25 mm/0.25 μm, He; Program: 40C(3min) => 4C/min => 75C => 8C/min => 250C(5min)

References

Cavalli, Fernandez, et al., 2003
Cavalli, J.-F.; Fernandez, X.; Lizzani-Cuvelier, L.; Loiseau, A.-M., Comparison of static headspace, headspace solid phase microextraction, headspace sorptive extraction, and direct thermal desorption techniques on chemical composition of French olive oils, J. Agric. Food Chem., 2003, 51, 26, 7709-7716, https://doi.org/10.1021/jf034834n . [all data]

Mildner-Szkudlarz and Jelen, 2008
Mildner-Szkudlarz, S.; Jelen, H.H., The potential of different techniques for volatile compounds analysis coupled with PCA for the detection of the adulteration of olive oil with hazelnut oil, Food Chem., 2008, 110, 3, 751-761, https://doi.org/10.1016/j.foodchem.2008.02.053 . [all data]

Berlioz, Cordella, et al., 2006
Berlioz, B.; Cordella, C.; Cavalli, J.-F.; Lizzani-Cuvelier, L.; Loiseau, A.-M.; Fernandez, X., Comparison of the amounts of volatile compounds in French protected designation of origin virgin olive oils, J. Agric. Food Chem., 2006, 54, 26, 10092-10101, https://doi.org/10.1021/jf061796+ . [all data]

Cavalli, Fernandez, et al., 2004
Cavalli, J.-F.; Fernandez, X.; Lizzani-Cievelier, L.; Loiseau, A.-M., Characterization of volatile compounds of French and Spanish virgin olive oil by HS-SPME: identification of quality-freshness markers, Food Chem., 2004, 88, 1, 151-157, https://doi.org/10.1016/j.foodchem.2004.04.003 . [all data]

Mildner-Szkudlarz, Jelen, et al., 2003
Mildner-Szkudlarz, S.; Jelen, H.H.; Zawirska-Wojtasiak, R.; Wasowicz, E., Application of headspace - solid phase microextraction and multivariate analysis for plant oils differentiation, Food Chem., 2003, 83, 4, 515-522, https://doi.org/10.1016/S0308-8146(03)00147-X . [all data]

Vichi, Castellote, et al., 2003
Vichi, S.; Castellote, A.I.; Pizzale, L.; Conte, L.S.; Buxaderas, S.; López-Tamames, E., Analysis of virgin olive oil volatile compounds by headspace solid-phase microextraction coupled to gas chromatography with mass spectrometric and flame ionization detection, J. Chromatogr. A, 2003, 983, 1-2, 19-33, https://doi.org/10.1016/S0021-9673(02)01691-6 . [all data]

Vichi, Pizzale, et al., 2003
Vichi, S.; Pizzale, L.; Conte, L.S.; Buxaderas, S.; López-Tamames, E., Solid-phase microextraction in the analysis of virgin olive oil volatile fraction: characterization of virgin olive oils from two distinct geographical areas of Northern Italy, J. Agric. Food Chem., 2003, 51, 22, 6572-6577, https://doi.org/10.1021/jf030269c . [all data]

Vichi, Guadayol, et al., 2007
Vichi, S.; Guadayol, J.M.; Caixach, J.; López-Tamames, E.; Buxaderas, S., Analytical, Nutritional, and Clinical Methods. Comparative study of different extraction techniques for the analysis of virgin olive oil aroma, Food Chem., 2007, 105, 3, 1171-1178, https://doi.org/10.1016/j.foodchem.2007.02.018 . [all data]