trans-6-Pentadecene
- Formula: C15H30
- Molecular weight: 210.3987
- IUPAC Standard InChIKey: BEPREHKVBQHGMZ-ACCUITESSA-N
- Chemical structure:
View 3d structure (requires JavaScript / HTML 5) - Stereoisomers:
- Other names: (E)-6-Pentadecene

Kovats' RI, non-polar column, isothermal

Column type | Active phase | Temperature (C) | I | Reference | Comment |
---|---|---|---|---|---|
Capillary | Apolane | 130. | 1475.5 | Soják, Krupcík, et al., 1980 | N2; Column length: 200. m; Column diameter: 0.25 mm |
Capillary | Apolane | 160. | 1477.4 | Soják, Krupcík, et al., 1980, 2 | N2 or H2; Column length: 250. m; Column diameter: 0.25 mm |
Capillary | Apiezon L | 154. | 1478.3 | Soják, Krupcík, et al., 1980, 2 | N2 or H2; Column length: 250. m; Column diameter: 0.25 mm |
Capillary | Squalane | 130. | 1476. | Soják, Hrivnák, et al., 1974 | |
Capillary | Squalane | 130. | 1477. | Soják, Hrivnák, et al., 1974 |

Kovats' RI, polar column, isothermal

Column type | Active phase | Temperature (C) | I | Reference | Comment |
---|---|---|---|---|---|
Capillary | PEG-20M | 110. | 1512. | Rang, Orav, et al., 1988 | |
Capillary | Carbowax 20M | 110. | 1512.4 | Soják, Krupcík, et al., 1980, 2 | N2; Column length: 300. m; Column diameter: 0.25 mm |

References

Soják, Krupcík, et al., 1980
Soják, L.; Krupcík, J.; Janák, J.,
Comparison of capillary columns coated with C87 hydrocarbon and squalane in the analysis of n-pentadecene isomers,
J. Chromatogr., 1980, 191, 199-206, https://doi.org/10.1016/S0021-9673(00)86380-3
. [all data]
Soják, Krupcík, et al., 1980, 2
Soják, L.; Krupcík, J.; Janák, J.,
Gas chromatography of all C15-C18 linear alkenes on capillary columns with very high resolution power,
J. Chromatogr., 1980, 195, 1, 43-64, https://doi.org/10.1016/S0021-9673(00)81542-3
. [all data]
Soják, Hrivnák, et al., 1974
Soják, L.; Hrivnák, J.; Ostrovský, I.; Janák, J.,
Capillary Gas Chromatography of Linear Alkenes on Squalane. Separation and Identification of n-Pentadecenes and n-Hexadecenes,
J. Chromatogr., 1974, 91, 613-622, https://doi.org/10.1016/S0021-9673(01)97942-7
. [all data]
Rang, Orav, et al., 1988
Rang, S.A.; Orav, A.E.; Kuningas, K.R.; Meister, A.E.; Strense, T.V.; Eisen, O.G.,
Gas-Chromatographic Characteristics of unsaturated hydrocarbons, Academy of Sciences of Estonia SSR, Tallinn, Estonia SSR, 1988, 208. [all data]