(E)-3-Pentadecene
- Formula: C15H30
- Molecular weight: 210.3987
- IUPAC Standard InChIKey: WNBDFALPKHFDJO-FNORWQNLSA-N
- Chemical structure:
View 3d structure (requires JavaScript / HTML 5) - Stereoisomers:
- Other names: trans-3-Pentadecene

Kovats' RI, non-polar column, isothermal

Column type | Active phase | Temperature (C) | I | Reference | Comment |
---|---|---|---|---|---|
Capillary | Apolane | 130. | 1484.1 | Soják, Krupcík, et al., 1980 | N2; Column length: 200. m; Column diameter: 0.25 mm |
Capillary | Apolane | 160. | 1484.6 | Soják, Krupcík, et al., 1980, 2 | N2 or H2; Column length: 250. m; Column diameter: 0.25 mm |
Capillary | Apiezon L | 154. | 1485.7 | Soják, Krupcík, et al., 1980, 2 | N2 or H2; Column length: 250. m; Column diameter: 0.25 mm |
Capillary | Squalane | 130. | 1485. | Soják, Hrivnák, et al., 1974 | |
Capillary | Squalane | 130. | 1485. | Soják, Hrivnák, et al., 1974 |

Kovats' RI, non-polar column, temperature ramp

Column type | Active phase | I | Reference | Comment |
---|---|---|---|---|
Capillary | OV-101 | 1491. | Tamura, Kihara, et al., 1991 | N2, 2. K/min; Column length: 50. m; Column diameter: 0.25 mm; Tstart: 80. C; Tend: 200. C |

Kovats' RI, polar column, isothermal

Column type | Active phase | Temperature (C) | I | Reference | Comment |
---|---|---|---|---|---|
Capillary | PEG-20M | 110. | 1523. | Rang, Orav, et al., 1988 | |
Capillary | Carbowax 20M | 110. | 1522.8 | Soják, Krupcík, et al., 1980, 2 | N2; Column length: 300. m; Column diameter: 0.25 mm |

Kovats' RI, polar column, temperature ramp

Column type | Active phase | I | Reference | Comment |
---|---|---|---|---|
Capillary | Carbowax 20M | 1540. | Tamura, Kihara, et al., 1991 | 2. K/min; Column length: 50. m; Column diameter: 0.25 mm; Tstart: 80. C; Tend: 180. C |

Normal alkane RI, non-polar column, temperature ramp

Column type | Active phase | I | Reference | Comment |
---|---|---|---|---|
Capillary | OV-101 | 1491. | Tamura, Kihara, et al., 1990 | Nitrogen, 2. K/min; Column length: 50. m; Column diameter: 0.25 mm; Tstart: 80. C; Tend: 200. C |

Normal alkane RI, polar column, temperature ramp

Column type | Active phase | I | Reference | Comment |
---|---|---|---|---|
Capillary | Carbowax 20M | 1540. | Tamura, Kihara, et al., 1990 | Nitrogen, 2. K/min; Column length: 50. m; Column diameter: 0.25 mm; Tstart: 80. C; Tend: 180. C |

References

Soják, Krupcík, et al., 1980
Soják, L.; Krupcík, J.; Janák, J.,
Comparison of capillary columns coated with C87 hydrocarbon and squalane in the analysis of n-pentadecene isomers,
J. Chromatogr., 1980, 191, 199-206, https://doi.org/10.1016/S0021-9673(00)86380-3
. [all data]
Soják, Krupcík, et al., 1980, 2
Soják, L.; Krupcík, J.; Janák, J.,
Gas chromatography of all C15-C18 linear alkenes on capillary columns with very high resolution power,
J. Chromatogr., 1980, 195, 1, 43-64, https://doi.org/10.1016/S0021-9673(00)81542-3
. [all data]
Soják, Hrivnák, et al., 1974
Soják, L.; Hrivnák, J.; Ostrovský, I.; Janák, J.,
Capillary Gas Chromatography of Linear Alkenes on Squalane. Separation and Identification of n-Pentadecenes and n-Hexadecenes,
J. Chromatogr., 1974, 91, 613-622, https://doi.org/10.1016/S0021-9673(01)97942-7
. [all data]
Tamura, Kihara, et al., 1991
Tamura, H.; Kihara, S.; Nakahara, K.; Sugisawa, H.,
A program for predicting aliphatic compounds using linear equations of GC retention index value,
Nippon Shokuhin Kogyo Gakkaishi, 1991, 38, 10, 934-939, https://doi.org/10.3136/nskkk1962.38.934
. [all data]
Rang, Orav, et al., 1988
Rang, S.A.; Orav, A.E.; Kuningas, K.R.; Meister, A.E.; Strense, T.V.; Eisen, O.G.,
Gas-Chromatographic Characteristics of unsaturated hydrocarbons, Academy of Sciences of Estonia SSR, Tallinn, Estonia SSR, 1988, 208. [all data]
Tamura, Kihara, et al., 1990
Tamura, H.; Kihara, S.; Sugisawa, H.,
A New Identification Method for Aliphatic Compounds Using Linear Equation of the GC Retention Index Value,
Agric. Biol. Chem., 1990, 54, 12, 3171-3176, https://doi.org/10.1271/bbb1961.54.3171
. [all data]