trans-3-Hexadecene
- Formula: C16H32
- Molecular weight: 224.4253
- IUPAC Standard InChIKey: QIZDLUWRENVVJW-FNORWQNLSA-N
- Chemical structure:
View 3d structure (requires JavaScript / HTML 5) - Stereoisomers:
- Other names: (E)-3-Hexadecene; 3-Hexadecene, (E)

Kovats' RI, non-polar column, isothermal

Column type | Active phase | Temperature (C) | I | Reference | Comment |
---|---|---|---|---|---|
Capillary | Apolane | 160. | 1584.6 | Soják, Krupcík, et al., 1980 | N2 or H2; Column length: 250. m; Column diameter: 0.25 mm |
Capillary | Apiezon L | 154. | 1585.7 | Soják, Krupcík, et al., 1980 | N2 or H2; Column length: 250. m; Column diameter: 0.25 mm |
Capillary | Squalane | 130. | 1584. | Soják, Hrivnák, et al., 1974 | |
Capillary | Squalane | 130. | 1585. | Soják, Hrivnák, et al., 1974 |

Kovats' RI, polar column, isothermal

Column type | Active phase | Temperature (C) | I | Reference | Comment |
---|---|---|---|---|---|
Capillary | PEG-20M | 110. | 1623. | Rang, Orav, et al., 1988 | |
Capillary | Carbowax 20M | 110. | 1621.8 | Soják, Krupcík, et al., 1980 | N2; Column length: 300. m; Column diameter: 0.25 mm |

References

Soják, Krupcík, et al., 1980
Soják, L.; Krupcík, J.; Janák, J.,
Gas chromatography of all C15-C18 linear alkenes on capillary columns with very high resolution power,
J. Chromatogr., 1980, 195, 1, 43-64, https://doi.org/10.1016/S0021-9673(00)81542-3
. [all data]
Soják, Hrivnák, et al., 1974
Soják, L.; Hrivnák, J.; Ostrovský, I.; Janák, J.,
Capillary Gas Chromatography of Linear Alkenes on Squalane. Separation and Identification of n-Pentadecenes and n-Hexadecenes,
J. Chromatogr., 1974, 91, 613-622, https://doi.org/10.1016/S0021-9673(01)97942-7
. [all data]
Rang, Orav, et al., 1988
Rang, S.A.; Orav, A.E.; Kuningas, K.R.; Meister, A.E.; Strense, T.V.; Eisen, O.G.,
Gas-Chromatographic Characteristics of unsaturated hydrocarbons, Academy of Sciences of Estonia SSR, Tallinn, Estonia SSR, 1988, 208. [all data]