(E)-2-Pentadecene
- Formula: C15H30
- Molecular weight: 210.3987
- IUPAC Standard InChIKey: PIKNPBDDTPJRGQ-HWKANZROSA-N
- Chemical structure:
View 3d structure (requires JavaScript / HTML 5) - Species with the same structure:
- Stereoisomers:
- Other names: trans-2-Pentadecene; 2-pentadecene (E)

Kovats' RI, non-polar column, isothermal

Column type | Active phase | Temperature (C) | I | Reference | Comment |
---|---|---|---|---|---|
Capillary | Apolane | 130. | 1498.3 | Soják, Krupcík, et al., 1980 | N2; Column length: 200. m; Column diameter: 0.25 mm |
Capillary | Apolane | 160. | 1498.8 | Soják, Krupcík, et al., 1980, 2 | N2 or H2; Column length: 250. m; Column diameter: 0.25 mm |
Capillary | Apiezon L | 154. | 1500.0 | Soják, Krupcík, et al., 1980, 2 | N2 or H2; Column length: 250. m; Column diameter: 0.25 mm |
Capillary | Squalane | 130. | 1497. | Soják, Hrivnák, et al., 1974 | |
Capillary | Squalane | 130. | 1498. | Soják, Hrivnák, et al., 1974 |

Kovats' RI, polar column, isothermal

Column type | Active phase | Temperature (C) | I | Reference | Comment |
---|---|---|---|---|---|
Capillary | PEG-20M | 110. | 1537. | Rang, Orav, et al., 1988 | |
Capillary | Carbowax 20M | 110. | 1537.4 | Soják, Krupcík, et al., 1980, 2 | N2; Column length: 300. m; Column diameter: 0.25 mm |

Van Den Dool and Kratz RI, non-polar column, custom temperature program

Column type | Active phase | I | Reference | Comment |
---|---|---|---|---|
Capillary | DB-5 | 1507. | Zaikin and Borisov, 2002 | He; Column length: 30. m; Column diameter: 0.25 mm; Program: 30C => 5K/min=120C => 10C/min => 270C |

Normal alkane RI, non-polar column, temperature ramp

Column type | Active phase | I | Reference | Comment |
---|---|---|---|---|
Capillary | Petrocol DH | 1501. | Sojak, Kubinec, et al., 2006 | 150. m/0.25 mm/1.0 μm, 1. K/min; Tstart: 40. C; Tend: 300. C |

References

Soják, Krupcík, et al., 1980
Soják, L.; Krupcík, J.; Janák, J.,
Comparison of capillary columns coated with C87 hydrocarbon and squalane in the analysis of n-pentadecene isomers,
J. Chromatogr., 1980, 191, 199-206, https://doi.org/10.1016/S0021-9673(00)86380-3
. [all data]
Soják, Krupcík, et al., 1980, 2
Soják, L.; Krupcík, J.; Janák, J.,
Gas chromatography of all C15-C18 linear alkenes on capillary columns with very high resolution power,
J. Chromatogr., 1980, 195, 1, 43-64, https://doi.org/10.1016/S0021-9673(00)81542-3
. [all data]
Soják, Hrivnák, et al., 1974
Soják, L.; Hrivnák, J.; Ostrovský, I.; Janák, J.,
Capillary Gas Chromatography of Linear Alkenes on Squalane. Separation and Identification of n-Pentadecenes and n-Hexadecenes,
J. Chromatogr., 1974, 91, 613-622, https://doi.org/10.1016/S0021-9673(01)97942-7
. [all data]
Rang, Orav, et al., 1988
Rang, S.A.; Orav, A.E.; Kuningas, K.R.; Meister, A.E.; Strense, T.V.; Eisen, O.G.,
Gas-Chromatographic Characteristics of unsaturated hydrocarbons, Academy of Sciences of Estonia SSR, Tallinn, Estonia SSR, 1988, 208. [all data]
Zaikin and Borisov, 2002
Zaikin, V.G.; Borisov, R.S.,
Chromatographic-mass spectrometric analysis of Fishcer-Tropsch synthesis products,
J. Anal. Chem. USSR (Engl. Transl.), 2002, 57, 6, 544-551. [all data]
Sojak, Kubinec, et al., 2006
Sojak, L.; Kubinec, R.; Jurdakova, H.; Hajekova, E.; Bajus, M.,
GC-MS of polyethylene and polypropylene thermal cracking produxts,
Petroleum Coal, 2006, 48, 1, 1-14. [all data]