Methyl cyclohexanecarboxylate, 4-(1,1-dimethylethyl), # 1

Kovats' RI, non-polar column, isothermal

View large format table.

Column type Active phase Temperature (C) I Reference Comment
PackedSE-30120.1333.Pascal, Heintz, et al., 1974Column length: 2. m
PackedSE-30140.1341.Pascal, Heintz, et al., 1974Column length: 2. m
PackedSE-30160.1350.Pascal, Heintz, et al., 1974Column length: 2. m

Kovats' RI, polar column, isothermal

View large format table.

Column type Active phase Temperature (C) I Reference Comment
PackedCarbowax 20M120.1639.Pascal, Heintz, et al., 1974Column length: 2. m
PackedCarbowax 20M140.1655.Pascal, Heintz, et al., 1974Column length: 2. m
PackedCarbowax 20M160.1671.Pascal, Heintz, et al., 1974Column length: 2. m

References

Pascal, Heintz, et al., 1974
Pascal, J.C.; Heintz, M.; Druilhe, A.; Lefort, D., Relations entre structure chimique et grandeurs de rétention. III. Stéréoisomères cyclohexaniques, Chromatographia, 1974, 7, 5, 236-245, https://doi.org/10.1007/BF02321774 . [all data]