Acetic acid, 2-cyano-2-[1-methyl-4-(1,1-dimethylethyl)cyclohexyl], ethyl ester, # 2

Kovats' RI, non-polar column, isothermal

View large format table.

Column type Active phase Temperature (C) I Reference Comment
PackedSE-30120.1781.Pascal, Heintz, et al., 1974Column length: 2. m
PackedSE-30140.1796.Pascal, Heintz, et al., 1974Column length: 2. m
PackedSE-30160.1811.Pascal, Heintz, et al., 1974Column length: 2. m

References

Pascal, Heintz, et al., 1974
Pascal, J.C.; Heintz, M.; Druilhe, A.; Lefort, D., Relations entre structure chimique et grandeurs de rétention. III. Stéréoisomères cyclohexaniques, Chromatographia, 1974, 7, 5, 236-245, https://doi.org/10.1007/BF02321774 . [all data]