cis,cis,cis,trans-1,2,3,4-Tetramethylcyclopentane
- Formula: C9H18
- Molecular weight: 126.2392
- IUPAC Standard InChIKey: INYXDKODFMWKER-BGZDPUMWSA-N
- Chemical structure:
View 3d structure (requires JavaScript / HTML 5) - Stereoisomers:
- 1α,2β,3α,4β-Tetramethylcyclopentane
- 1,2,3,4-Tetramethyl-cyclopentane
- 1-trans-2-cis-3-trans-4-tetramethylcyclopentane
- 1-cis-2-trans-3-cis-4-tetramethylcyclopentane
- 1-trans-2-trans-3-cis-4-tetramethylcyclopentane
- cis,cis,trans,trans-1,2,3,4-Tetramethylcyclopentane
- cis,trans,cis,cis-1,2,3,4-Tetramethylcyclopentane
- Other names: 1-cis-2-cis-3-trans-4-tetramethylcyclopentane

Kovats' RI, non-polar column, isothermal

Column type | Active phase | Temperature (C) | I | Reference | Comment |
---|---|---|---|---|---|
Capillary | Squalane | 50. | 857.9 | Lunskii and Paizanskaya, 1988 | He; Column length: 50. m; Column diameter: 0.22 mm |
Capillary | Squalane | 70. | 862.7 | Lunskii and Paizanskaya, 1988 | He; Column length: 50. m; Column diameter: 0.22 mm |
Capillary | Vacuum Grease Oil (VM-4) | 35. | 851. | Sidorov, Petrova, et al., 1972 | |
Capillary | Vacuum Grease Oil (VM-4) | 45. | 854. | Sidorov, Petrova, et al., 1972 | |
Capillary | Vacuum Grease Oil (VM-4) | 50. | 857. | Sidorov, Petrova, et al., 1972 | |
Capillary | Vacuum Grease Oil (VM-4) | 58. | 858. | Sidorov, Petrova, et al., 1972 | |
Capillary | Vacuum Grease Oil (VM-4) | 68. | 862. | Sidorov, Petrova, et al., 1972 | |
Packed | Vacuum Grease Oil (VM-4) | 35. | 851. | Sidorov, Ivanova, et al., 1971 |

References

Lunskii and Paizanskaya, 1988
Lunskii, M.Kh.; Paizanskaya, I.L.,
Identification of hydrocarbons C1-C9 of petrol fractions of oils and condensates in the use of capillary columns with dinonylphthalate,
Zh. Anal. Khim., 1988, 43, 127-135. [all data]
Sidorov, Petrova, et al., 1972
Sidorov, R.I.; Petrova, V.I.; Ivanova, M.P.,
Qualitative analysis of wide-boiling fraction C5-C10 with capillary chromatography
in Processes in chromatographic columns. Vol.17, 1972, 14-25. [all data]
Sidorov, Ivanova, et al., 1971
Sidorov, R.I.; Ivanova, M.P.; Petrova, V.I.,
Temperature dependence of cycloalkane's retention and its using in identification of structure,
Gazovaya Khromatografiya, 1971, 15, 18-26. [all data]