11-Ketoandrosterone MO TMS

Van Den Dool and Kratz RI, non-polar column, temperature ramp

Data compiled by: NIST Mass Spectrometry Data Center, William E. Wallace, director

Column type PackedPackedPackedCapillaryPacked
Active phase OV-101SE-30OV-1SE-30SE-30
Column length (m) 3.63.620.20.20.
Carrier gas   HeHeHe
Substrate Gas-Chrom P (80-100 mesh)Gas-Chrom P (80-100 mesh)
Column diameter (mm)   0.250.250.25
Phase thickness (μm)
Tstart (C) 180.180.180.200.180.
Tend (C)
Heat rate (K/min) 1.1.1.1.1.
Initial hold (min)
Final hold (min)
I 2627.2630.2600.2633.2600.
ReferenceHurter and van Ree, 1979Hurter and van Ree, 1979Luyten and Rutten, 1974Luyten and Rutten, 1974Luyten and Rutten, 1974
Comment MSDC-RI MSDC-RI MSDC-RI MSDC-RI MSDC-RI

References

Hurter and van Ree, 1979
Hurter, P.; van Ree, T., Programmed-Temperature Gas Chromatography on Mixed Phases. Separation of Steroid Derivatives on Binary Mixtures, J. Chromatogr., 1979, 169, 93-100, https://doi.org/10.1016/0021-9673(75)85034-5 . [all data]

Luyten and Rutten, 1974
Luyten, J.A.; Rutten, G.A.F.M., Analysis of Steroids by High-Resolution Gas-Liquid Chromatography. II. Application to Urinary Samples, J. Chromatogr., 1974, 91, 393-406, https://doi.org/10.1016/S0021-9673(01)97918-X . [all data]