Tetradecane, 5-ethyl

Normal alkane RI, non-polar column, temperature ramp

Data compiled by: NIST Mass Spectrometry Data Center, William E. Wallace, director

Column type Capillary
Active phase OV-1
Column length (m) 25.
Carrier gas H2
Substrate
Column diameter (mm) 0.31
Phase thickness (μm) 0.15
Tstart (C) 70.
Tend (C) 220.
Heat rate (K/min) 3.
Initial hold (min)
Final hold (min)
I 1568.
ReferenceRamaroson-Raonizafinimanana, Gaydou, et al., 1997
Comment MSDC-RI

Kovats' RI, non-polar column, isothermal

Data compiled by: NIST Mass Spectrometry Data Center, William E. Wallace, director

Column type Capillary
Active phase Apiezon L
Column length (m)
Carrier gas
Substrate
Column diameter (mm)
Phase thickness (μm)
Temperature (C) 100.
I 1528.
ReferenceRappoport and Gäumann, 1973
Comment MSDC-RI

References

Ramaroson-Raonizafinimanana, Gaydou, et al., 1997
Ramaroson-Raonizafinimanana, B.; Gaydou, E.M.; Bombarda, I., Hydrocarbons from three vanilla bean species: V. fragrans, V. madagascariensis, and V. tahitensis, J. Agric. Food Chem., 1997, 45, 7, 2542-2545, https://doi.org/10.1021/jf960927b . [all data]