2,4-Octadienal, (E,Z)-
- Formula: C8H12O
- Molecular weight: 124.1803
- IUPAC Standard InChIKey: DVVATNQISMINCX-SCFJQAPRSA-N
- Chemical structure:
View 3d structure (requires JavaScript / HTML 5) - Stereoisomers:

Van Den Dool and Kratz RI, non-polar column, temperature ramp

Column type | Active phase | I | Reference | Comment |
---|---|---|---|---|
Capillary | SE-30 | 1076. | Misharina and Golovnya, 1996 | 50. m/0.32 mm/0.25 μm, 4. K/min; Tstart: 50. C; Tend: 250. C |

References

Misharina and Golovnya, 1996
Misharina, T.A.; Golovnya, R.V.,
Study of the composition of volatiles in raw and processed sardine by gas chromatography and gas chromatography-mass spectrometry,
Zh. Anal. Khim., 1996, 51, 7, 791-795. [all data]