GA64, MeTMS

Van Den Dool and Kratz RI, non-polar column, custom temperature program

Data compiled by: NIST Mass Spectrometry Data Center, William E. Wallace, director

Column type Capillary
Active phase DB-1
Column length (m) 15.
Carrier gas
Substrate
Column diameter (mm) 0.22
Phase thickness (μm) 0.25
Program 60(0.1 min)-200 0C at 20 deg/min; 200-300 0C at 5 deg/min
I 2754.
ReferencePearce, Koshioka, et al., 1994
Comment MSDC-RI

References

Pearce, Koshioka, et al., 1994
Pearce, D.W.; Koshioka, M.; Pharis, R.P., Chromatography of gibberellins, J. Chromatogr. A, 1994, 658, 1, 91-122, https://doi.org/10.1016/0021-9673(94)85210-3 . [all data]