GA35, MeTMSi

Van Den Dool and Kratz RI, non-polar column, custom temperature program

Data compiled by: NIST Mass Spectrometry Data Center, William E. Wallace, director

Column type CapillaryCapillaryCapillary
Active phase DB-1SE-52SE-52
Column length (m) 15.25.25.
Carrier gas  HeHe
Substrate
Column diameter (mm) 0.220.220.22
Phase thickness (μm) 0.250.250.25
Program 60(0.1 min)-200 0C at 20 deg/min; 200-300 0C at 5 deg/min50C => 15C/min => 240C => 4C/min => 300C50C => 15C/min => 240C => 4C/min => 300C
I 2644.2642.2643.
ReferencePearce, Koshioka, et al., 1994Hedden, Hoad, et al., 1993Hedden, Hoad, et al., 1993
Comment MSDC-RI MSDC-RI MSDC-RI

References

Pearce, Koshioka, et al., 1994
Pearce, D.W.; Koshioka, M.; Pharis, R.P., Chromatography of gibberellins, J. Chromatogr. A, 1994, 658, 1, 91-122, https://doi.org/10.1016/0021-9673(94)85210-3 . [all data]

Hedden, Hoad, et al., 1993
Hedden, P.; Hoad, G.V.; Gaskin, P.; Lewis, M.J.; Green, J.R.; Furber, M.; Mander, L.N., Kaurenoids and gibberellins, including the newly characterized gibberellin A88, in developing apple seeds, Phytochemistry, 1993, 32, 2, 231-237, https://doi.org/10.1016/S0031-9422(00)94973-2 . [all data]