Apigenin, TMS
- Formula: C24H34O5Si3
- Molecular weight: 486.7803
- IUPAC Standard InChIKey: CCZQELBLBRCVLH-UHFFFAOYSA-N
- Chemical structure:
View 3d structure (requires JavaScript / HTML 5) - Other names: APIGENIN 3TMS; 4',5,7-Trihydroxyflavone, tris-TMS; Flavone, 4',5,7-trihydroxy, TMS

Kovats' RI, non-polar column, isothermal

Column type | Active phase | Temperature (C) | I | Reference | Comment |
---|---|---|---|---|---|
Capillary | DB-1 | 280. | 3142.2 | Stremple, 1996 | 30. m/0.25 mm/0.25 μm, H2 |

Van Den Dool and Kratz RI, non-polar column, temperature ramp

Column type | Active phase | I | Reference | Comment |
---|---|---|---|---|
Capillary | DB-5MS | 3137.5 | Jonsson, Johansson, et al., 2005 | 10. m/0.18 mm/0.18 μm, 70. C @ 2. min, 40. K/min, 320. C @ 2. min |

Normal alkane RI, non-polar column, temperature ramp

Column type | Active phase | I | Reference | Comment |
---|---|---|---|---|
Capillary | HP-5 | 3128. | Isidorov, Kotowska, et al., 2005 | 30. m/0.25 mm/0.25 μm, He, 5. K/min; Tstart: 50. C; Tend: 300. C |

References

Stremple, 1996
Stremple, P.,
Improved separation and identification of aglycon flavonoids by gas chromatography on phenylmethylsilicone copolymers,
J. Hi. Res. Chromatogr., 1996, 19, 10, 581-584, https://doi.org/10.1002/jhrc.1240191010
. [all data]
Jonsson, Johansson, et al., 2005
Jonsson, P.; Johansson, A.I.; Gullberg, J.; Trygg, J.; Jiye, A.; Grung, B.; Marklund, S.; Sjöström, M.; Antti, H.; Moritz, T.,
High-throughput data analysis for detecting and identifying differences between samples in GC/MS-based metabolomic analyses,
Anal. Chem., 2005, 77, 17, 5635-5642, https://doi.org/10.1021/ac050601e
. [all data]
Isidorov, Kotowska, et al., 2005
Isidorov, V.A.; Kotowska, U.; Vinogorova, V.T.,
GC Identification of organic compounds based on partition coefficients of their TMS derivatives in a hexane-acetonitrile system and retention indices,
Anal. Sci., 2005, 21, 12, 1483-1489, https://doi.org/10.2116/analsci.21.1483
. [all data]