4-Octen-1-ol, (Z)-, butanoate
- Formula: C12H22O2
- Molecular weight: 198.3019
- IUPAC Standard InChIKey: ALDNKJSWCRXURS-SREVYHEPSA-N
- Chemical structure:
View 3d structure (requires JavaScript / HTML 5) - Stereoisomers:
- Other names: (Z)-4-Octen-1-yl butanoate

Normal alkane RI, non-polar column, temperature ramp

Column type | Active phase | I | Reference | Comment |
---|---|---|---|---|
Capillary | DB-1 | 1354. | Shiota, 1993 | 30. m/0.25 mm/0.25 μm, He, 50. C @ 3. min, 5. K/min; Tend: 240. C |
Capillary | DB-1 | 1356. | Shiota, 1993 | 30. m/0.25 mm/0.25 μm, He, 50. C @ 3. min, 5. K/min; Tend: 240. C |
Capillary | DB-1 | 1357. | Shiota, 1993 | 30. m/0.25 mm/0.25 μm, He, 50. C @ 5. min, 3. K/min; Tend: 240. C |
Capillary | DB-1 | 1358. | Shiota, 1993 | 30. m/0.25 mm/0.25 μm, He, 50. C @ 5. min, 3. K/min; Tend: 240. C |

References

Shiota, 1993
Shiota, H.,
New esteric components in the volatiles of banana fruit (Musa sapientum L.),
J. Agric. Food Chem., 1993, 41, 11, 2056-2062, https://doi.org/10.1021/jf00035a046
. [all data]