Selina-4,11-dien-14-al
- Formula: C15H22O
- Molecular weight: 218.3346
- IUPAC Standard InChIKey: VNYQZKHAWVXJCR-WFASDCNBSA-N
- Chemical structure:
View 3d structure (requires JavaScript / HTML 5) - Stereoisomers:

Normal alkane RI, non-polar column, custom temperature program

Column type | Active phase | I | Reference | Comment |
---|---|---|---|---|
Capillary | SE-30 | 1758. | Vinogradov, 2004 | Program: not specified |
Capillary | Polydimethyl siloxanes | 1758. | Zenkevich, 1997 | Program: not specified |
Capillary | DB-1 | 1758. | Ishihara, Tsuneya, et al., 1993 | Program: not specified |

References

Vinogradov, 2004
Vinogradov, B.A.,
Production, composition, properties and application of essential oils, 2004, retrieved from http://viness.narod.ru. [all data]
Zenkevich, 1997
Zenkevich, I.G.,
Analytical Parameters of Components of Essential Oils for their Chromatographic and Chromato-Spectral Identificaiton. Oxsigenated derivatives of Mono- and Sesquiterpene Hydrocarbons,
Rastit, Resursy (Rus.), 1997, 33, 1, 16-28. [all data]
Ishihara, Tsuneya, et al., 1993
Ishihara, M.; Tsuneya, T.; Uneyama, K.,
Components of the Volatile Concentrate of Agarwood,
J. Essent. Oil Res., 1993, 5, 3, 283-289, https://doi.org/10.1080/10412905.1993.9698221
. [all data]