Pentane, 2-methoxy-2-methyl-
- Formula: C7H16O
- Molecular weight: 116.2013
- IUPAC Standard InChIKey: WYLQOLGJMFRRLX-UHFFFAOYSA-N
- Chemical structure:
View 3d structure (requires JavaScript / HTML 5) - Species with the same structure:

Kovats' RI, non-polar column, custom temperature program

Column type | Active phase | I | Reference | Comment |
---|---|---|---|---|
Capillary | DB-1 | 763. | Hoekman, 1993 | 60. m/0.32 mm/1.0 μm, He; Program: -40 C for 12 min; -40 - 125 C at 3 deg.min; 125-185 C at 6 deg/min; 185 - 220 C at 20 deg/min; hold 220 C for 2 min |

References

Hoekman, 1993
Hoekman, S.K.,
Improved gas chromatography procedure for speciated hydrocarbon measurements of vehicle emissions,
J. Chromatogr., 1993, 639, 2, 239-253, https://doi.org/10.1016/0021-9673(93)80260-F
. [all data]