2,4,6-triphenyl-1-hexene

Van Den Dool and Kratz RI, non-polar column, temperature ramp

View large format table.

Column type Active phase I Reference Comment
CapillarySE-542428.8Shapi and Hesso, 199025. m/0.32 mm/0.15 μm, He, 40. C @ 1. min, 5. K/min, 280. C @ 15. min
CapillarySE-542428.8Shapi and Hesso, 199025. m/0.32 mm/0.15 μm, He, 40. C @ 1. min, 5. K/min, 280. C @ 15. min
CapillarySE-542428.8Shapi and Hesso, 199025. m/0.32 mm/0.15 μm, He, 40. C @ 1. min, 5. K/min, 280. C @ 15. min

Normal alkane RI, non-polar column, temperature ramp

View large format table.

Column type Active phase I Reference Comment
CapillaryOV-1012440.Blazso, Ujszaszi, et al., 198010. K/min; Column length: 20. m; Column diameter: 0.23 mm; Tstart: 60. C; Tend: 280. C

References

Shapi and Hesso, 1990
Shapi, M.M.; Hesso, A., Thermal decomposition of polystyrene volatile compounds from large-scale pyrolysis, J. Anal. Appl. Pyrolysis, 1990, 18, 2, 143-161, https://doi.org/10.1016/0165-2370(90)80004-8 . [all data]

Blazso, Ujszaszi, et al., 1980
Blazso, M.; Ujszaszi, K.; Jakab, E., Isomeric structure of styrene-acrylonitrile and styrene-methylacrylate copolymer pyrolysis products, Chromatographia, 1980, 13, 3, 151-156, https://doi.org/10.1007/BF02259304 . [all data]