1-Butene, 2,4-diphenyl

Kovats' RI, non-polar column, isothermal

View large format table.

Column type Active phase Temperature (C) I Reference Comment
CapillaryOV-101120.1666.Blazsó and Garzó, 1974Column length: 20. m
CapillaryOV-101180.1710.Blazsó and Garzó, 1974Column length: 20. m

Van Den Dool and Kratz RI, non-polar column, temperature ramp

View large format table.

Column type Active phase I Reference Comment
CapillarySE-541706.0Shapi and Hesso, 199025. m/0.32 mm/0.15 μm, He, 40. C @ 1. min, 5. K/min, 280. C @ 15. min
CapillarySE-541706.0Shapi and Hesso, 199025. m/0.32 mm/0.15 μm, He, 40. C @ 1. min, 5. K/min, 280. C @ 15. min

Normal alkane RI, non-polar column, temperature ramp

View large format table.

Column type Active phase I Reference Comment
CapillarySP-21001691.Fischer and Kusch, 1993He, 40. C @ 3. min, 5. K/min; Column length: 30. m; Column diameter: 0.25 mm; Tend: 280. C
PackedSE-301670.Khudobina and Zenkevich, 1984Helium, Chromosorb W (80-100 mesh), 50. C @ 0. min, 5. K/min, 250. C @ 0. min; Column length: 1.8 m
CapillaryOV-1011702.Blazso, Ujszaszi, et al., 198010. K/min; Column length: 20. m; Column diameter: 0.23 mm; Tstart: 60. C; Tend: 280. C

References

Blazsó and Garzó, 1974
Blazsó, M.; Garzó, G., Identification of Isomeric Structures of Phenyl and Trimethylsilyl Substituted 1-Alkenes by Gas Chromatography, Chromatographia, 1974, 7, 8, 395-398, https://doi.org/10.1007/BF02330942 . [all data]

Shapi and Hesso, 1990
Shapi, M.M.; Hesso, A., Thermal decomposition of polystyrene volatile compounds from large-scale pyrolysis, J. Anal. Appl. Pyrolysis, 1990, 18, 2, 143-161, https://doi.org/10.1016/0165-2370(90)80004-8 . [all data]

Fischer and Kusch, 1993
Fischer, G.W.; Kusch, P., An Automated Curie-Point Pyrolysis-High Resolution Gas Chromatography System, LC-GC Int., 1993, 6, 12, 760-763. [all data]

Khudobina and Zenkevich, 1984
Khudobina, G.V.; Zenkevich, I.G., Chromato Mass Spectrometric Identification of Dimers in Recycled Styrene, VINITI, # 8039-84, 1984, 14. [all data]

Blazso, Ujszaszi, et al., 1980
Blazso, M.; Ujszaszi, K.; Jakab, E., Isomeric structure of styrene-acrylonitrile and styrene-methylacrylate copolymer pyrolysis products, Chromatographia, 1980, 13, 3, 151-156, https://doi.org/10.1007/BF02259304 . [all data]