1H-Imidazole, 1-pentyl
- Formula: C8H14N2
- Molecular weight: 138.2102
- IUPAC Standard InChIKey: UPYVYJSWGZMBOU-UHFFFAOYSA-N
- Chemical structure:
View 3d structure (requires JavaScript / HTML 5) - Permanent link for this species. Use this link for bookmarking this species for future reference.

Kovats' RI, non-polar column, isothermal

Column type | Active phase | Temperature (C) | I | Reference | Comment |
---|---|---|---|---|---|
Capillary | OV-101 | 110. | 1258. | Golovnya, Zhuravleva, et al., 1992 | 30. m/0.30 mm/0.20 μm |

Kovats' RI, polar column, isothermal

Column type | Active phase | Temperature (C) | I | Reference | Comment |
---|---|---|---|---|---|
Capillary | PEG-40M/KF | 170. | 1956. | Golovnya, Zhuravleva, et al., 1992 | 30. m/0.3 mm/0.2 μm |

References

Golovnya, Zhuravleva, et al., 1992
Golovnya, R.V.; Zhuravleva, I.L.; Sal'kova, M.A.,
Prediction of Retention Indexes of Alkylimadazoles Under Conditions of Capillary Gas Chromatography,
J. Anal. Chem. USSR (Engl. Transl.), 1992, 7, 932-937. [all data]