(E,E)-Farnesyl caprylate
- Formula: C23H40O2
- Molecular weight: 348.5625
- IUPAC Standard InChIKey: HHSVAJNBWYMLPB-QMEDZHDISA-N
- Chemical structure:
View 3d structure (requires JavaScript / HTML 5) - Stereoisomers:
- Other names: Farnesyl octanoate, (E,E)-

Van Den Dool and Kratz RI, polar column, temperature ramp

Column type | Active phase | I | Reference | Comment |
---|---|---|---|---|
Capillary | ZB-FFAP | 2669. | Lee, Finckbeiner, et al., 2007 | 30. m/0.25 mm/0.25 μm, He, 2.5 K/min; Tstart: 100. C; Tend: 250. C |

Normal alkane RI, non-polar column, temperature ramp

Column type | Active phase | I | Reference | Comment |
---|---|---|---|---|
Capillary | DB-1 | 2373. | Shiota, 1991 | 60. m/0.25 mm/0.25 μm, He, 3. K/min; Tstart: 50. C; Tend: 240. C |
Capillary | DB-1 | 2375. | Shiota, 1991 | 60. m/0.25 mm/0.25 μm, He, 3. K/min; Tstart: 50. C; Tend: 240. C |

References

Lee, Finckbeiner, et al., 2007
Lee, H.; Finckbeiner, S.; Yu, J.S.; Wiemer, D.F.; Eisner, T.; Attygalle, A.B.,
Characterization of (E,E)-farnesol and its fatty acid esters from anal scent glands of nutria (Myocastor coypus) by gas chromatography-mass spectrometry and gas chromatography-infrared spectrometry,
J. Chromatogr. A, 2007, 1165, 1-2, 136-143, https://doi.org/10.1016/j.chroma.2007.06.041
. [all data]
Shiota, 1991
Shiota, H.,
Volatile components of pawpaw fruit (Asimina triloba Dunal.),
J. Agric. Food Chem., 1991, 39, 9, 1631-1635, https://doi.org/10.1021/jf00009a019
. [all data]