4-Methylhex-5-en-4-olide

Normal alkane RI, non-polar column, custom temperature program

View large format table.

Column type Active phase I Reference Comment
CapillaryHP-51054.Citron, Riclea, et al., 2011Program: not specified

References

Citron, Riclea, et al., 2011
Citron, C.A.; Riclea, R.; Brock, N.L.; Dickschat, J.S., Biosynthesis of acorane sesquiterpenes by Trichoderma. Electronic supplemental materials (ESI), Royal Soc. Chem., 2011, 1-10. [all data]