Oxazole, 4-ethyl-5-methyl
- Formula: C6H9NO
- Molecular weight: 111.1418
- IUPAC Standard InChIKey: CRARVVVEJLFERY-UHFFFAOYSA-N
- Chemical structure:
View 3d structure (requires JavaScript / HTML 5) - Permanent link for this species. Use this link for bookmarking this species for future reference.

Kovats' RI, non-polar column, isothermal

Column type | Active phase | Temperature (C) | I | Reference | Comment |
---|---|---|---|---|---|
Capillary | OV-101 | 110. | 855. | Golovnya, Zhuravleva, et al., 1991 | 50. m/0.30 mm/0.4 μm, He |

Kovats' RI, polar column, isothermal

Column type | Active phase | Temperature (C) | I | Reference | Comment |
---|---|---|---|---|---|
Capillary | PEG-40M | 110. | 1222. | Golovnya, Zhuravleva, et al., 1991 | 50. m/0.30 mm/0.4 μm, He |

Normal alkane RI, polar column, custom temperature program

Column type | Active phase | I | Reference | Comment |
---|---|---|---|---|
Capillary | Carbowax | 1200. | Baltes and Bochmann, 1987 | Program: not specified |
Capillary | Carbowax | 1200. | Baltes and Bochmann, 1987 | Program: not specified |
Capillary | Carbowax | 1201. | Baltes and Bochmann, 1987 | Program: not specified |
Capillary | Carbowax | 1201. | Baltes and Bochmann, 1987 | Program: not specified |

References

Golovnya, Zhuravleva, et al., 1991
Golovnya, R.V.; Zhuravleva, I.L.; Yakush, E.V.; Schenderjuk, V.V.,
Retentions of alkyloxazoles and alkythiazoles and their prediction based on non-linear additivity concepts in gas chromatography,
J. Chromatogr., 1991, 552, 1-12, https://doi.org/10.1016/S0021-9673(01)95918-7
. [all data]
Baltes and Bochmann, 1987
Baltes, W.; Bochmann, G.,
Model reactions on roast aroma formations, V. Mass spectrometric identification of pyrifines, oxazoles, and carbocyclic compounds from the reaction of serine and threonine with sucrose under the conditions of coffee roasting,
Z. Lebensm. Unters. Forsch., 1987, 185, 1, 5-9, https://doi.org/10.1007/BF01083331
. [all data]