Oxazole, 2-methyl-5-propyl
- Formula: C7H11NO
- Molecular weight: 125.1683
- IUPAC Standard InChIKey: DDDRMAQEYHTVNK-UHFFFAOYSA-N
- Chemical structure:
View 3d structure (requires JavaScript / HTML 5) - Permanent link for this species. Use this link for bookmarking this species for future reference.

Kovats' RI, non-polar column, isothermal

Column type | Active phase | Temperature (C) | I | Reference | Comment |
---|---|---|---|---|---|
Capillary | OV-101 | 110. | 901. | Golovnya, Zhuravleva, et al., 1991 | 50. m/0.30 mm/0.4 μm, He |

Kovats' RI, polar column, isothermal

Column type | Active phase | Temperature (C) | I | Reference | Comment |
---|---|---|---|---|---|
Capillary | PEG-40M | 110. | 1229. | Golovnya, Zhuravleva, et al., 1991 | 50. m/0.30 mm/0.4 μm, He |
Capillary | PEG-40M | 110. | 1247. | Golovnya, Shenderyuk, et al., 1989 | 47. m/0.30 mm/0.40 μm, He |

References

Golovnya, Zhuravleva, et al., 1991
Golovnya, R.V.; Zhuravleva, I.L.; Yakush, E.V.; Schenderjuk, V.V.,
Retentions of alkyloxazoles and alkythiazoles and their prediction based on non-linear additivity concepts in gas chromatography,
J. Chromatogr., 1991, 552, 1-12, https://doi.org/10.1016/S0021-9673(01)95918-7
. [all data]
Golovnya, Shenderyuk, et al., 1989
Golovnya, R.V.; Shenderyuk, V.V.; Zhuravleva, I.L.; Yakush, E.V.,
Use of a principle of non-additivity of sorption energies for calculation of retention indices of alkyloxazoles in capillary chromatography,
Zh. Anal. Khim., 1989, 44, 2037-2042. [all data]