Eremophylene
- Formula: C15H24
- Molecular weight: 204.3511
- IUPAC Standard InChIKey: ZZPSOALECBMAMW-LWEDLAQUSA-N
- Chemical structure:

Normal alkane RI, non-polar column, custom temperature program

Column type | Active phase | I | Reference | Comment |
---|---|---|---|---|
Capillary | HP-5 MS | 1489. | Liu, Chu, et al., 2010 | 30. m/0.25 mm/0.25 μm, Helium; Program: 60 0C (1 min) 10 0C/min -> 180 0C (1 min) 20 0C/min -> 280 0C (15 min) |

References

Liu, Chu, et al., 2010
Liu, Z.L.; Chu, S.S.; Liu, Q.R.,
Chemical composition and insecticidial activity against Sitophilus zeamais of the essential oils of Artemisia capillaris and Artemisia mongolica,
Molecules, 2010, 15, 4, 2600-2608, https://doi.org/10.3390/molecules15042600
. [all data]