cis-Muurola-3,5-diene

Normal alkane RI, non-polar column, temperature ramp

View large format table.

Column type Active phase I Reference Comment
CapillaryDB-51450.Ho, Wang, et al., 201030. m/0.25 mm/0.25 μm, Helium, 2. K/min; Tstart: 50. C; Tend: 250. C
CapillaryHP-51446.Kahriman, Tosun, et al., 201030. m/0.32 mm/0.25 μm, Helium, 60. C @ 2. min, 3. K/min; Tend: 240. C
CapillaryHP-51454.Radulovic, Dordevic, et al., 201030. m/0.25 mm/0.25 μm, Hydrogen, 5. K/min; Tstart: 70. C; Tend: 290. C

Normal alkane RI, non-polar column, custom temperature program

View large format table.

Column type Active phase I Reference Comment
Capillary5 % Phenyl polydimethyl siloxane1449.Chaverri, Diaz, et al., 2011Program: not specified
CapillaryHP-51450.Kahriman, Tosun, et al., 201030. m/0.32 mm/0.25 μm, Helium; Program: not specified

References

Ho, Wang, et al., 2010
Ho, C.-L.; Wang, E.I.-C.; Yu, H.-T.; Yu, H.-M.; Su, Y.-C., Composition amd antioxidant activities of essential oils of different tissues from Cryptomeria japonica D. Don, Quarterly J. Chin. Forestry, 2010, 32, 1, 63-76. [all data]

Kahriman, Tosun, et al., 2010
Kahriman, N.; Tosun, G.; Genc, H.; Yayli, N., Comparative essential oil analysis of Geranium sylvaticum estracted by hydrodistillation and microwave distillation, Turk. J. Chem., 2010, 34, 969-976. [all data]

Radulovic, Dordevic, et al., 2010
Radulovic, N.S.; Dordevic, N.D.; Palic, R.M., Volatiles of Pleurospermum austriacum (L.) Hoffm. (Apiaceae), J. Serbian Chem. Soc., 2010, 75, 12, 1-11, https://doi.org/10.2298/JSC100323127R . [all data]

Chaverri, Diaz, et al., 2011
Chaverri, C.; Diaz, C.; Cicco, J.F., Chemical analysis of essential oils from Ocotea gomezii W.C. Burger and Ocotea morae Gomez-Laur. (Lauraceae) collected at Reserva biologica Alberto M. Brenes in Costa Rica and their cytotoxic activity on Tumor cell lines, J. Braz. Chem. Soc., 2011, 22, 4, s1-s4, https://doi.org/10.1590/S0103-50532011000400018 . [all data]