8α-Acetoxyelemol

Normal alkane RI, non-polar column, temperature ramp

View large format table.

Column type Active phase I Reference Comment
CapillaryHP-51788.Cavar, Maksimovic, et al., 201030. m/0.252 mm/0.25 μm, Helium, 3. K/min; Tstart: 60. C; Tend: 240. C

Normal alkane RI, non-polar column, custom temperature program

View large format table.

Column type Active phase I Reference Comment
CapillaryHP-5 MS1775.Payo, Colo, et al., 2011Program: not specified
CapillaryHP-5 MS1779.Payo, Colo, et al., 2011Program: not specified
CapillaryHP-5 MS1781.Payo, Colo, et al., 2011Program: not specified
CapillaryHP-5 MS1782.Payo, Colo, et al., 2011Program: not specified
CapillaryHP-5 MS1789.Payo, Colo, et al., 2011Program: not specified

References

Cavar, Maksimovic, et al., 2010
Cavar, S.; Maksimovic, M.; Solic, M.E., Comparison of essential oil composition of Stachys menthufolia Vis. from two natural habitas in Croatia, Biologica Nyssana, 2010, 1, 1-2, 99-103. [all data]

Payo, Colo, et al., 2011
Payo, D.A.; Colo, J.; Calumpong, H.; de Clerck, O., Variability of non-polar secondary metabolites in the Red Alga Portieria, Mar Drugs, 2011, 9, 11, 2438-2468, https://doi.org/10.3390/md9112438 . [all data]