α-trans-Bergamotene

Normal alkane RI, non-polar column, custom temperature program

Data compiled by: NIST Mass Spectrometry Data Center, William E. Wallace, director

Column type CapillaryCapillaryCapillaryCapillary
Active phase HP-5HP-5HP-5 MSDB-5 MS
Column length (m) 30.30.30.30.
Carrier gas NitrogenHeliumHeliumHelium
Substrate
Column diameter (mm) 0.350.320.250.25
Phase thickness (μm) 0.250.250.250.25
Program 60 0C 3 0C/min -> 210 0C 5 0C/min -> 250 0C (2 min)not specified40 0C (10 min) 3 0C/min -> 200 0C 2 0C/min -> 220 0Cnot specified
I 1439.1435.1436.1436.
ReferenceVeres, Csupor-Loffler, et al., 2012Kahriman, Tosun, et al., 2011Nance and Setzer, 2011Su, Wang, et al., 2009
Comment MSDC-RI MSDC-RI MSDC-RI MSDC-RI

Normal alkane RI, non-polar column, temperature ramp

Data compiled by: NIST Mass Spectrometry Data Center, William E. Wallace, director

Column type CapillaryCapillaryCapillary
Active phase HP-5DB-5DB-5 MS
Column length (m) 30.30.30.
Carrier gas HeliumHeliumHelium
Substrate
Column diameter (mm) 0.320.250.25
Phase thickness (μm) 0.250.250.25
Tstart (C) 60.60.40.
Tend (C) 240.240.250.
Heat rate (K/min) 3.3.4.
Initial hold (min) 2. 2.
Final hold (min)   2.
I 1437.1436.1436.
ReferenceKahriman, Tosun, et al., 2011Magalhaes, Lima, et al., 2010Su, Wang, et al., 2009
Comment MSDC-RI MSDC-RI MSDC-RI

References

Veres, Csupor-Loffler, et al., 2012
Veres, K.; Csupor-Loffler, B.; Lazar, A.; Holmann, J., Antifungal activity and composition of essential oils of Conyza canadensis herbs and roots, The Sci. World. J., 2012, 2012, 1-5, https://doi.org/10.1100/2012/489646 . [all data]

Kahriman, Tosun, et al., 2011
Kahriman, N.; Tosun, G.; Terzioglu, S.; Karaoglu, S.A.; Yayh, N., Chemical composition and antimicrobial activity of the essential oils from the flower, leaf, and stem of Senecio pandurifolis, Rec. Nat. Prod., 2011, 5, 2, 82-91. [all data]

Nance and Setzer, 2011
Nance, M.R.; Setzer, W.N., Volatile components of aroma hops (Humulus lupulus L.) commonly used in beer brewing, J. of Brewing and Distilling, 2011, 2, 2, 16-22. [all data]

Su, Wang, et al., 2009
Su, Y.; Wang, C.; Yinlong, G., Analysis of volatile compounds from Mentha hapioealyx Briq. by GC-MS based on accurate mass measurements and retention indices, Acta Chem. Sinica, 2009, 67, 6, 546-554. [all data]