Coahuilensol methyl ether

Normal alkane RI, non-polar column, temperature ramp

Data compiled by: NIST Mass Spectrometry Data Center, William E. Wallace, director

Column type Capillary
Active phase DB-5
Column length (m) 30.
Carrier gas Nitrogen
Substrate
Column diameter (mm) 0.25
Phase thickness (μm) 0.25
Tstart (C) 40.
Tend (C) 250.
Heat rate (K/min) 3.
Initial hold (min) 1.
Final hold (min) 10.
I 1196.
ReferenceRahmi-Nasrabadi, Gholivand, et al., 2009
Comment MSDC-RI

References

Rahmi-Nasrabadi, Gholivand, et al., 2009
Rahmi-Nasrabadi, M.; Gholivand, M.B.; Batooli, H., Chemical composition of the essential oil from leaves and flowering aerial parts of Haplophyllum robustum Bge. (Rutaceae), Digest J. Nanomaterials Biostructures, 2009, 4, 4, 819-822. [all data]