(E)-8-Hydroxylinalool

Normal alkane RI, polar column, custom temperature program

View large format table.

Column type Active phase I Reference Comment
CapillaryCP-Wax 52 CB2265.Genisheva and Oliveira, 200950. m/0.25 mm/0.20 μm, Helium; Program: 60 0C (5 min) 3 0C/min -> 250 0C (20 min) 1 0C/min -> 255 0C

References

Genisheva and Oliveira, 2009
Genisheva, Z.; Oliveira, J.M., Monoterpenic characterization of white cultivars from Vinhos Verdes appelation of origin (North Portugal), J. Inst. Brewing, 2009, 115, 4, 308-317, https://doi.org/10.1002/j.2050-0416.2009.tb00386.x . [all data]