γ-Cuprenene

Normal alkane RI, non-polar column, custom temperature program

View large format table.

Column type Active phase I Reference Comment
CapillaryHP-51523.Citron, Riclea, et al., 2011Program: not specified
CapillaryHP-51536.Citron, Riclea, et al., 2011Program: not specified
CapillaryHP-51537.Custer, 200925. m/0.32 mm/0.17 μm, Helium; Program: 60 0C (5 min) 4 0C/min -> 220 0C 11 0C/min -> 280 0C (15 min)
CapillaryHP-51533.Custer, 200925. m/0.32 mm/0.17 μm, Helium; Program: not specified

References

Citron, Riclea, et al., 2011
Citron, C.A.; Riclea, R.; Brock, N.L.; Dickschat, J.S., Biosynthesis of acorane sesquiterpenes by Trichoderma. Electronic supplemental materials (ESI), Royal Soc. Chem., 2011, 1-10. [all data]

Custer, 2009
Custer, Y., GC Volatile Components Analysis of Different Parts of Litchi chinensis (Dissertation), 2009. [all data]