1,1-Ethanedithiol

Normal alkane RI, non-polar column, temperature ramp

View large format table.

Column type Active phase I Reference Comment
CapillaryHG-5756.Drumm and Spanier, 199150. m/0.32 mm/0.52 μm, He, 35. C @ 15. min, 3. K/min, 250. C @ 45. min

References

Drumm and Spanier, 1991
Drumm, T.D.; Spanier, A.M., Changes in the content of lipid autoxidation and sulfur-containing compounds in cooked beef during storage, J. Agric. Food Chem., 1991, 39, 2, 336-343, https://doi.org/10.1021/jf00002a023 . [all data]