2,4,6,10-Dodecatetraene
- Formula: C12H18
- Molecular weight: 162.2713
- IUPAC Standard InChIKey: FQMSKVLEYYJMON-YXDPKGGVSA-N
- Chemical structure:
View 3d structure (requires JavaScript / HTML 5) - Permanent link for this species. Use this link for bookmarking this species for future reference.

Kovats' RI, non-polar column, isothermal

Column type | Active phase | Temperature (C) | I | Reference | Comment |
---|---|---|---|---|---|
Packed | SE-30 | 120. | 1321. | Drugov, Murav'eva, et al., 1991 | N2, Chromaton N AW (0.20-0.25 mm); Column length: 2. m |
Packed | SE-30 | 120. | 1324. | Drugov, Murav'eva, et al., 1991 | N2, Chromaton N AW (0.20-0.25 mm); Column length: 2. m |

References

Drugov, Murav'eva, et al., 1991
Drugov, Yu.S.; Murav'eva, G.V.; Shlyakhov, A.F.,
Gas-Chromatographic Determination of 1,3-Butadine Trimers in the Atmosphere,
J. Anal. Chem. USSR (Engl. Transl.), 1991, 8, 1155-1160. [all data]