(Z)-β-Damascenone

Normal alkane RI, polar column, custom temperature program

Data compiled by: NIST Mass Spectrometry Data Center, William E. Wallace, director

Column type Capillary
Active phase Innowax
Column length (m) 60.
Carrier gas
Substrate
Column diameter (mm) 0.25
Phase thickness (μm) 0.33
Program not specified
I 1835.
ReferenceNoorizadeh, Farmany, et al., 2011
Comment MSDC-RI

References

Noorizadeh, Farmany, et al., 2011
Noorizadeh, H.; Farmany, A.; Noorizadeh, M., Quantitative structure-retention relationships analysis of retention index of essential oils, Quim. Nova, 2011, 34, 2, 242-249, https://doi.org/10.1590/S0100-40422011000200014 . [all data]