cis-Whisky lactone

Normal alkane RI, non-polar column, custom temperature program

View large format table.

Column type Active phase I Reference Comment
CapillaryCP-Sil 5 CB1281.Bailly, Jerkovic, et al., 200650. m/0.32 mm/1.20 μm, Helium; Program: 36 0C 20 0C/min -> 85 0C 1 0C/min -> 1345 0C 3 0C/min -> 250 0C

References

Bailly, Jerkovic, et al., 2006
Bailly, S.; Jerkovic, V.; Collin, S., Identification of key-odorants in Sauternes wines, Identification of key-odorants in Sauternes wines, 5th International Terroir Congress, 2006, 4. [all data]