2,6-Octadien-1-ol

Normal alkane RI, polar column, temperature ramp

View large format table.

Column type Active phase I Reference Comment
CapillaryDB-Wax1758.Sawamura, Sou, et al., 200460. m/0.25 mm/0.25 μm, Nitrogen, 70. C @ 2. min, 2. K/min; Tend: 230. C

References

Sawamura, Sou, et al., 2004
Sawamura, M.; Sou, U.-S.; Choi, H.-S.; Kim, M.-S.; Phi, N.T.L.; Fears, M.; Kumagai. C., Composition changes in commercial lemon essential oil for aromatherapy, Int. J. Aromatherapy, 2004, 14, 1, 27-36, https://doi.org/10.1016/j.ijat.2004.02.001 . [all data]