4-Mercaptononyl-2-acetate, # 2

Normal alkane RI, non-polar column, custom temperature program

View large format table.

Column type Active phase I Reference Comment
CapillaryCP-Sil 5 CB1438.Vermeulen, Lecocq, et al., 200325. m/0.32 mm/1.20 μm, Helium; Program: 40 0C (4 min) 2 0C/min -> 132 0C 10 0C/min -> 250 0C (45 min)

References

Vermeulen, Lecocq, et al., 2003
Vermeulen, C.; Lecocq, S.; Collin, S., Polyfunctional thiols and drinkability of beer, Polyfunctional thiols and drinkability of beer, 29th European Brewery Convention Congress, Dublin, Ireland, 17-22 May 2003, 2003, 11, retrieved from http://hdl.handle.net/2078.1/72705. [all data]