1-Mercaptopentan-3-ol

Normal alkane RI, non-polar column, custom temperature program

View large format table.

Column type Active phase I Reference Comment
CapillaryCP-Sil 5 CB981.Liu, Cao, et al., 2009Column length: 50. m; Column diameter: 0.32 mm; Program: not specified
CapillaryCP-Sil 5 CB981.Vermeulen, Lecocq, et al., 200325. m/0.32 mm/1.20 μm, Helium; Program: 40 0C (4 min) 2 0C/min -> 132 0C 10 0C/min -> 250 0C (45 min)

References

Liu, Cao, et al., 2009
Liu, F.; Cao, C.; Li, X., Quantitative structure-retention relationship study of mercapto-compounds by the method of dividing the molecular structure into substructure, QSAR Comb. Sci., 2009, 28, 11-12, 1358-1366, https://doi.org/10.1002/qsar.200960043 . [all data]

Vermeulen, Lecocq, et al., 2003
Vermeulen, C.; Lecocq, S.; Collin, S., Polyfunctional thiols and drinkability of beer, Polyfunctional thiols and drinkability of beer, 29th European Brewery Convention Congress, Dublin, Ireland, 17-22 May 2003, 2003, 11, retrieved from http://hdl.handle.net/2078.1/72705. [all data]