β-Oplopenone

Normal alkane RI, polar column, custom temperature program

Data compiled by: NIST Mass Spectrometry Data Center, William E. Wallace, director

Column type CapillaryCapillary
Active phase InnowaxHP Innowax
Column length (m) 60.60.
Carrier gas
Substrate
Column diameter (mm) 0.250.25
Phase thickness (μm) 0.330.33
Program not specifiednot specified
I 2098.2098.
ReferenceNoorizadeh, Farmany, et al., 2011Noorizadeh and Farmany, 2010
Comment MSDC-RI MSDC-RI

References

Noorizadeh, Farmany, et al., 2011
Noorizadeh, H.; Farmany, A.; Noorizadeh, M., Quantitative structure-retention relationships analysis of retention index of essential oils, Quim. Nova, 2011, 34, 2, 242-249, https://doi.org/10.1590/S0100-40422011000200014 . [all data]

Noorizadeh and Farmany, 2010
Noorizadeh, H.; Farmany, A., Exploration of linear and nonlinear modeling techniques to predict of retention index of essential oils, J. Chin. Chem. Soc., 2010, 1268-1277. [all data]