Aetiocholanolone, MO-TBDMS

Normal alkane RI, non-polar column, isothermal

View large format table.

Column type Active phase Temperature (C) I Reference Comment
PackedOV-1270.2805.Gaskell and Pike, 1981Helium, Gas Chrom Q (100-120 mesh); Column length: 3. m

References

Gaskell and Pike, 1981
Gaskell, S.J.; Pike, A.W., Gas chromatography mass spectrometry of androstanolones as methyl oxime, tert-butyldimethylsilyl ether derivatives, Biomed. Mass Spectrom., 1981, 8, 3, 125-127, https://doi.org/10.1002/bms.1200080309 . [all data]