1,1,3,-trans-4-Tetrachlorocyclohexane
- Formula: C6H8Cl4
- Molecular weight: 221.940
- IUPAC Standard InChIKey: JKCJRSJDMMWXCB-RFZPGFLSSA-N
- Chemical structure:

Normal alkane RI, non-polar column, temperature ramp

Column type | Active phase | I | Reference | Comment |
---|---|---|---|---|
Capillary | OV-101 | 1352. | Zenkevich, Eliseenkov, et al., 2009 | 25. m/0.20 mm/0.25 μm, Nitrogen, 6. K/min; Tstart: 60. C; Tend: 240. C |
Capillary | OV-101 | 1353. | Zenkevich, Eliseenkov, et al., 2009 | 25. m/0.20 mm/0.25 μm, Nitrogen, 6. K/min; Tstart: 60. C; Tend: 240. C |

References

Zenkevich, Eliseenkov, et al., 2009
Zenkevich, I.G.; Eliseenkov, E.V.; Kasatochkin, A.N.,
Chromatographic Identification of Cyclohexane Chlorination Products by an Additive Scheme for the Prediction of Retention Indices,
Chromatographia, 2009, 70, 5/6, 839-849, https://doi.org/10.1365/s10337-009-1213-x
. [all data]