trans-Dihydrocarveol
- Formula: C10H18O
- Molecular weight: 154.2493
- IUPAC Standard InChIKey: KRCZYMFUWVJCLI-AEJSXWLSSA-N
- Chemical structure:
View 3d structure (requires JavaScript / HTML 5) - Stereoisomers:

Normal alkane RI, non-polar column, temperature ramp

Column type | Active phase | I | Reference | Comment |
---|---|---|---|---|
Capillary | DB-1 MS | 1168. | Seo, Kim, et al., 2009 | 30. m/0.25 mm/0.25 μm, Helium, 40. C @ 1. min, 6. K/min, 250. C @ 4. min |

References

Seo, Kim, et al., 2009
Seo, S.-M.; Kim, J.; Lee, S.-G.; Shin, C.-H.; Shin, S.-C.; Park, I.-K.,
Fumigant antitermitic activity of plant essential oils and components from Aiowan (Trachyspermum ammi), Allspice (Pimenta dioica), Caraway (Carum carvi), Dill (Anethum graveolens), Geranium (Pelargonium graveolens), and Litsea (Litsea cubeba( oils against Japanese termite (Reticulitermes speratus Kolbe),
J. Agric. Food Chem., 2009, 57, 15, 6596-6602. [all data]